{"text_format":"1","workbook":"xlsx","n_sheets":33,"sheets":["CIA","TPC","TVOU","TLIBROS","TCOMPROB","TDOC","TPAGO","TCLIEN","TPROVEE","TBCOS","TBCOSCIA","TOTROS","VOUDIARIO","BDDIARIO","BDASTODIARIO","CONSDIARIO1","LDIARIO","CONSULMAYOR","LMAYOR","BDRVENTA","BDASTOVENTA","BDRCOMPRA","BDASTOCOMPRA","BDCAJA","BDASTOCAJA","BDBANCO","BDASTOBANCO","CONSULHT","HT","BG","ER","Hoja1","ae"],"not_rendered":{"charts":0,"images":23,"macros":1,"external_links":0,"defined_names":26,"comments":0,"pivot_tables":0},"unopened":[],"bounds":{"document_bytes":16777216,"sheet_cells":100000,"rows_first":2000,"rows_last":500,"rows_between":2000,"halvings":0,"cell_chars":16384,"cell_head_chars":4096},"cells_cut":0,"cells_raw":0,"read":"whole","date_system":"1900"}

{"sheet":"CIA","index":0,"n_rows":13,"n_cols":12,"rows_kept":13,"cut":false,"hidden":true,"merged":[[0,0,0,2]]}
["EMPRESA"]
["NOMBRE","ARCHIVO EXCEL EIRL",null,null,null,"ENERO",null,null,"NUEVOS SOLES",null,null,"INGRESO"]
["RUC",20123456789,null,null,null,"FEBRERO",null,null,"DÓLARES AMERICANOS",null,null,"EGRESO"]
["PERIODO",2013,null,null,null,"MARZO"]
["MES","ENERO",null,null,null,"ABRIL"]
["IGV",0.18,null,null,null,"MAYO"]
[null,null,null,null,null,"JUNIO"]
[null,null,null,null,null,"JULIO"]
[null,null,null,null,null,"AGOSTO"]
[null,null,null,null,null,"SEPTIEMBRE"]
[null,null,null,null,null,"OCTUBRE"]
[null,null,null,null,null,"NOVIEMBRE"]
[null,null,null,null,null,"DICIEMBRE"]

{"sheet":"TPC","index":1,"n_rows":3144,"n_cols":6,"rows_kept":3144,"cut":false,"hidden":true,"merged":[]}
["PLAN DE CUENTAS"]
["x"]
["CTA","REGISTRO","NOMBRE","AMAR. DEB.","AMAR. HAB.","GRUPO"]
[10,null,"EFECTIVO Y EQUIVALENTES DE EFECTIVO"]
[101,10100,"Caja",null,null,1]
[102,10200,"Fondos fijos",null,null,1]
[103,10300,"Efectivo en Tránsito",null,null,1]
[104,null,"Cuentas corrientes en instituciones financieras"]
[1041,10410,"Cuentas corrientes operativas",null,null,1]
[1042,10420,"Cuentas corrientes para fines específicos",null,null,1]
[105,null,"Otros equivalentes de efectivo"]
[1051,10510,"Otros equivalentes de efectivo",null,null,1]
[106,null,"Depósitos en instituciones financieras"]
[1061,10610,"Depósitos de ahorro",null,null,1]
[1062,10620,"Depósitos a plazo",null,null,1]
{"$rows_left_out":3130}
{"sheet":"TVOU","index":2,"n_rows":9,"n_cols":14,"rows_kept":9,"cut":false,"hidden":true,"merged":[]}
["TIPO DE VOUCHERS"]
["CÓDIGO","DETALLE",1,2,3,4,5,6,7,8,9,10,11,12]
[1,"APERTURA",1,0,0,0,0,0,0,0,0,0,0,0]
[2,"VENTAS",1,0,0,0,0,0,0,0,0,0,0,0]
[3,"COMPRAS",2,0,0,0,0,0,0,0,0,0,0,0]
[4,"CAJA",1,0,0,0,0,0,0,0,0,0,0,0]
[5,"BANCOS",0,0,0,0,0,0,0,0,0,0,0,0]
[6,"DIARIO",1,0,0,0,0,0,0,0,0,0,0,0]
[7,"PLANILLA",0,0,0,0,0,0,0,0,0,0,0,0]

{"sheet":"TLIBROS","index":3,"n_rows":33,"n_cols":2,"rows_kept":33,"cut":false,"hidden":true,"merged":[]}
["TIPOS DE LIBROS"]
["CÓDIGO","                                                                          NOMBRE O DESCRIPCIÓN"]
[1,"LIBRO CAJA Y BANCOS"]
[2,"LIBRO DE INGRESOS Y GASTOS"]
[3,"LIBRO DE INVENTARIOS Y BALANCES"]
[4,"LIBRO DE RETENCIONES INCISOS E) Y F) DEL ARTICULO 34° DE LA LEY DEL IMPUESTO A LA RENTA"]
[5,"LIBRO DIARIO"]
[6,"LIBRO MAYOR"]
[7,"REGISTRO DE ACTIVOS FIJOS"]
[8,"REGISTRO DE COMPRAS"]
[9,"REGISTRO DE CONSIGNACIONES"]
[10,"REGISTRO DE COSTOS"]
[11,"REGISTRO DE HUÉSPEDES"]
[12,"REGISTRO DE INVENTARIO PERMANENTE EN UNIDADES FÍSICAS"]
[13,"REGISTRO DE INVENTARIO PERMANENTE VALORIZADO"]
{"$rows_left_out":19}
{"sheet":"TCOMPROB","index":4,"n_rows":50,"n_cols":2,"rows_kept":50,"cut":false,"hidden":true,"merged":[]}
["TIPOS DE COMPROBANTES"]
["N°","                                                        DESCRIPCIÓN"]
["00","OTROS (ESPECIFICAR)"]
["01","FACTURA"]
["02","RECIBO POR HONORARIOS"]
["03","BOLETA DE VENTA"]
["04","LIQUIDACIÓN DE COMPRA"]
["05","BOLETO DE COMPAÑÍA DE AVIACIÓN COMERCIAL POR EL SERVICIO DE TRANSPORTE AÉREO DE PASAJEROS"]
["06","CARTA DE PORTE AÉREO POR EL SERVICIO DE TRANSPORTE DE CARGA AÉREA"]
["07","NOTA DE CRÉDITO"]
["08","NOTA DE DÉBITO"]
["09","GUÍA DE REMISIÓN - REMITENTE"]
["10","RECIBO POR ARRENDAMIENTO"]
["11","PÓLIZA EMITIDA POR LAS BOLSAS DE VALORES, BOLSAS DE PRODUCTOS O AGENTES DE INTERMEDIACIÓN POR OPERACIONES REALIZADAS EN LAS BOLSAS DE VALORES O PRODUCTOS O FUERA DE LAS MISMAS, AUTORIZADAS POR CONASEV"]
["12","TICKET O CINTA EMITIDO POR MÁQUINA REGISTRADORA"]
{"$rows_left_out":36}
{"sheet":"TDOC","index":5,"n_rows":7,"n_cols":2,"rows_kept":7,"cut":false,"hidden":true,"merged":[]}
["TIPOS DE DOCUMENTOS"]
["N°","                                   DESCRIPCIÓN"]
["0","OTROS TIPOS DE DOCUMENTOS"]
["1","DOCUMENTO NACIONAL DE IDENTIDAD (DNI)"]
[4,"CARNET DE EXTRANJERIA"]
[6,"REGISTRO ÚNICO DE CONTRIBUYENTES"]
[7,"PASAPORTE"]

{"sheet":"TPAGO","index":6,"n_rows":22,"n_cols":2,"rows_kept":22,"cut":false,"hidden":true,"merged":[]}
["TIPO DE MEDIO DE PAGO"]
["N°","                                                             DESCRIPCIÓN"]
["001","DEPÓSITO EN CUENTA"]
["002","GIRO"]
["003","TRANSFERENCIA DE FONDOS"]
["004","ORDEN DE PAGO"]
["005","TARJETA DE DÉBITO"]
["006","TARJETA DE CRÉDITO"]
["007","CHEQUES CON LA CLÁUSULA DE \"NO NEGOCIABLE\", \"INTRANSFERIBLES\", \"NO A LA ORDEN\" U OTRA EQUIVALENTE, A QUE SE REFIERE EL INCISO F) DEL ARTICULO 5° DEL DECRETO LEGISLATIVO."]
["008","EFECTIVO, POR OPERACIONES EN LAS QUE NO EXISTE OBLIGACIÓN DE UTILIZAR MEDIOS DE PAGO"]
["009","EFECTIVO, EN LOS DEMÁS CASOS"]
["010","MEDIOS DE PAGO DE COMERCIO EXTERIOR"]
["011","LETRAS DE CAMBIO"]
["101","TRANSFERENCIAS - COMERCIO EXTERIOR"]
["102","CHEQUES BANCARIOS  - COMERCIO EXTERIOR"]
{"$rows_left_out":8}
{"sheet":"TCLIEN","index":7,"n_rows":8,"n_cols":3,"rows_kept":8,"cut":false,"hidden":true,"merged":[]}
["CLIENTES"]
["NÚMERO","NOMBRE O RAZÓN SOCIAL","TIPO"]
["10101010101","SONIDO DIGITAL EIRL",6]
["10123456789","EL NATURAL",6]
["10987654321","EL PREFERIDO SAC",6]
["20123456789","EL JURIDICO",6]
["20134567890","A1 EIRL",6]
[20556622331,"SISTEMAS SAC",6]

{"sheet":"TPROVEE","index":8,"n_rows":4,"n_cols":3,"rows_kept":4,"cut":false,"hidden":true,"merged":[]}
["PROVEEDORES"]
["NÚMERO","NOMBRE O RAZÓN SOCIAL","TIPO"]
["10663322112","AM AP NOMB",6]
["20445566778","EL QUE TODO LO TIENE SAC",6]

{"sheet":"TBCOS","index":9,"n_rows":66,"n_cols":2,"rows_kept":66,"cut":false,"hidden":true,"merged":[]}
["ENTIDADES FINANCIERAS"]
["N°","DESCRIPCIÓN"]
["00","OTROS (ESPECIFICAR)"]
["02","DE CRÉDITO DEL PERÚ                "]
["03","INTERBANK                          "]
["05","LATINO                             "]
["07","CITYBANK N.A.                      "]
["08","STANDARD CHARTERED                 "]
["09","WIESE SUDAMERIS                    "]
["11","CONTINENTAL                        "]
["12","DE LIMA                            "]
["16","MERCANTIL                          "]
["18","NACIÓN                             "]
["22","SANTANDER CENTRAL HISPANO - PERÚ   "]
["23","DE COMERCIO                        "]
{"$rows_left_out":52}
{"sheet":"TBCOSCIA","index":10,"n_rows":4,"n_cols":4,"rows_kept":4,"cut":false,"hidden":true,"merged":[]}
["BANCOS EMPRESA"]
["N° CUENTA","MONEDA","CÓDIGO","DESCRIPCIÓN"]
["1944578958965","DÓLARES AMERICANOS",2,"DE CRÉDITO DEL PERÚ                "]
["19123456789524","NUEVOS SOLES",2,"DE CRÉDITO DEL PERÚ                "]

{"sheet":"TOTROS","index":11,"n_rows":5,"n_cols":2,"rows_kept":5,"cut":false,"hidden":true,"merged":[]}
["OTRAS ENTIDADES"]
["CÓDIGO","                                        DESCRIPCIÓN"]
["E001","SOCIO"]
["E002","EMPLEADO"]
["E003","OBRERO"]

{"sheet":"VOUDIARIO","index":12,"n_rows":18,"n_cols":12,"rows_kept":18,"cut":false,"hidden":true,"merged":[]}
[null,"VOUCHER -DIARIO",null,null,null,null,null,null,null,null,null,"REGISTRO"]
[null,"MES",1,"ENERO","VOUCHER",3,"Nº VOU.",{"$f":"IF(AND(C2>0,F2>0),INDEX(TVOU!B3:N24,MATCH(F2,TVOU!A3:A24,0),MATCH(C2,TVOU!B2:N2,0)),0)+1","v":3},null,null,null,132]
[null,"x",null,null,null,null,null,null,null,null,null,46001]
[null,"FECHA","31/01/2013",null,null,"DOCUMENTO:","TIPO",14]
[null,"LIBRO",8,"REGISTRO DE COMPRAS",null,null,"SERIE","T004"]
[null,"OPERAC.",2,null,null,null,"NÚM. o TRANS.",15234889]
[null,"x"]
[null,"BANCO",null,null,null,"CTA. CTE."]
[null,"MEDIO PAG.",null,null,null,"ENTIDAD",10663322112,"AM AP NOMB"]
[null,"x"]
[null,"GLOSA","LUZ"]
[null,"x",null,null,{"$f":"IF(H12<>I12,\"NO CUADRA\",\"\")","v":""},{"$f":"H12-I12","v":0},"TOTALES",{"$f":"SUM(H14:H499958)","v":218},{"$f":"SUM(I14:I499958)","v":218}]
[null,"ITEM","CUENTA","NOMBRE","-","--","---","DEBE","HABER","REGISTRO","MES"]
[null,1,63610,"Energía eléctrica",null,null,null,100,0,132,1]
[null,1,79100,"Cargas imputables a cuentas de costos y gastos",null,null,null,0,100,132,1]
{"$rows_left_out":4}
{"sheet":"BDDIARIO","index":13,"n_rows":7,"n_cols":12,"rows_kept":7,"cut":false,"hidden":true,"merged":[]}
["REGISTRO","MES","TVOUCHER","VOUCHER","FECHA","LIBRO","OPERACIÓN","TIPO","SERIE","NUMERO","ENTIDAD","GLOSA"]
[111,1,1,1,"2013-01-02",3,1,null,null,null,null,"POR EL INICIO DE OPERACIONES"]
[121,1,2,1,"15/01/2013",14,1,1,1,1,20134567890,"VENTA DE MERCADERÍA"]
[131,1,3,1,"2013-01-05",8,1,1,10,1524,20445566778,"COMPRA DE MERCDERÍA"]
[132,1,3,2,"31/01/2013",8,2,14,"T004",15234889,10663322112,"LUZ"]
[141,1,4,1,"31/01/2013",1,1,1,1,1,20134567890,"COBRO DEL MES"]
[161,1,6,1,"31/01/2013",null,null,null,null,null,null,"COSTO DE VENTA DEL MES"]

{"sheet":"BDASTODIARIO","index":14,"n_rows":22,"n_cols":10,"rows_kept":22,"cut":false,"hidden":true,"merged":[]}
["REGISTRO","MES","ITEM","CUENTA","NOMBRE","DEBE","HABER","-","--","---"]
[111,1,1,10100,"Caja",50000,0]
[111,1,2,50110,"Acciones",0,50000]
[131,1,1,20111,"Costo",20000,0]
[131,1,1,61110,"Mercaderías manufacturadas",0,20000]
[131,1,1,60110,"Costo",20000,0]
[131,1,2,40111,"IGV - Cuenta propia",3600,0]
[131,1,3,42120,"Emitidas",0,23600]
[121,1,1,12120,"Emitidas en cartera",23600,0]
[121,1,2,40111,"IGV - Cuenta propia",0,3600]
[121,1,3,70111,"Terceros",0,20000]
[161,1,1,69111,"Terceros",10000,0]
[161,1,2,20111,"Costo",0,10000]
[161,1,3,61110,"Mercaderías manufacturadas",10000,0]
[161,1,4,79100,"Cargas imputables a cuentas de costos y gastos",0,10000]
{"$rows_left_out":8}
{"sheet":"CONSDIARIO1","index":15,"n_rows":17,"n_cols":34,"rows_kept":17,"cut":false,"hidden":true,"merged":[]}
["MES","REGISTRO","MES","CUENTA","NOMBRE","DEBE","HABER","TVOUCHER","VOUCHER","FECHA","GLOSA","LIBRO","OPERACIÓN","TIPO","SERIE","NUMERO","ENTIDAD","MES","REGISTRO","MES","TVOUCHER","VOUCHER","FECHA","GLOSA","LIBRO","OPERACIÓN","TIPO","SERIE","NUMERO","CUENTA","NOMBRE","DEBE","HABER","ENTIDAD"]
["<1",null,null,null,null,null,null,null,null,null,null,null,null,null,null,null,null,1,111,1,1,1,41276,"POR EL INICIO DE OPERACIONES",3,1,0,0,0,10100,"Caja",50000,0,0]
[null,null,null,null,null,null,null,null,null,null,null,null,null,null,null,null,null,null,111,1,1,1,41276,"POR EL INICIO DE OPERACIONES",3,1,0,0,0,50110,"Acciones",0,50000,0]
[null,null,null,null,null,null,null,null,null,null,null,null,null,null,null,null,null,null,131,1,3,1,41279,"COMPRA DE MERCDERÍA",8,1,1,10,1524,20111,"Costo",20000,0,20445566778]
[null,null,null,null,null,null,null,null,null,null,null,null,null,null,null,null,null,null,131,1,3,1,41279,"COMPRA DE MERCDERÍA",8,1,1,10,1524,61110,"Mercaderías manufacturadas",0,20000,20445566778]
[null,null,null,null,null,null,null,null,null,null,null,null,null,null,null,null,null,null,131,1,3,1,41279,"COMPRA DE MERCDERÍA",8,1,1,10,1524,60111,"Costo",20000,0,20445566778]
[null,null,null,null,null,null,null,null,null,null,null,null,null,null,null,null,null,null,131,1,3,1,41279,"COMPRA DE MERCDERÍA",8,1,1,10,1524,40111,"IGV - Cuenta propia",3600,0,20445566778]
[null,null,null,null,null,null,null,null,null,null,null,null,null,null,null,null,null,null,131,1,3,1,41279,"COMPRA DE MERCDERÍA",8,1,1,10,1524,42120,"Emitidas",0,23600,20445566778]
[null,null,null,null,null,null,null,null,null,null,null,null,null,null,null,null,null,null,121,1,2,1,"15/01/2013","VENTA DE MERCADERÍA",14,1,1,1,1,12120,"Emitidas en cartera",23600,0,20134567890]
[null,null,null,null,null,null,null,null,null,null,null,null,null,null,null,null,null,null,121,1,2,1,"15/01/2013","VENTA DE MERCADERÍA",14,1,1,1,1,40111,"IGV - Cuenta propia",0,3600,20134567890]
[null,null,null,null,null,null,null,null,null,null,null,null,null,null,null,null,null,null,121,1,2,1,"15/01/2013","VENTA DE MERCADERÍA",14,1,1,1,1,70111,"Terceros",0,20000,20134567890]
[null,null,null,null,null,null,null,null,null,null,null,null,null,null,null,null,null,null,161,1,6,1,"31/01/2013","COSTO DE VENTA DEL MES",0,0,0,0,0,69111,"Terceros",10000,0,0]
[null,null,null,null,null,null,null,null,null,null,null,null,null,null,null,null,null,null,161,1,6,1,"31/01/2013","COSTO DE VENTA DEL MES",0,0,0,0,0,20111,"Costo",0,10000,0]
[null,null,null,null,null,null,null,null,null,null,null,null,null,null,null,null,null,null,161,1,6,1,"31/01/2013","COSTO DE VENTA DEL MES",0,0,0,0,0,61110,"Mercaderías manufacturadas",10000,0,0]
[null,null,null,null,null,null,null,null,null,null,null,null,null,null,null,null,null,null,161,1,6,1,"31/01/2013","COSTO DE VENTA DEL MES",0,0,0,0,0,79100,"Cargas imputables a cuentas de costos y gastos",0,10000,0]
{"$rows_left_out":3}
{"sheet":"LDIARIO","index":16,"n_rows":27,"n_cols":14,"rows_kept":27,"cut":false,"hidden":true,"merged":[[7,9,8,9],[7,10,8,10],[7,11,8,11],[7,12,8,12],[6,13,8,13],[6,2,8,2],[6,3,8,3],[7,4,8,4],[7,5,8,5],[6,0,7,1]]}
["LIBRO DIARIO",null,null,null,null,null,null,null,null,null,null,null,"ENERO"]
["X"]
[{"$f":"CONCATENATE(\"PERÍODO: \",mesconsulta,\" - \",periodo)","v":"PERÍODO: ENERO - 2013"}]
[{"$f":"CONCATENATE(\"RUC: \",ruc)","v":"RUC: 20123456789"}]
[{"$f":"IF(razon>\"\",razon,\"\")","v":"ARCHIVO EXCEL EIRL"}]
["X"]
["NÚMERO CORREL. DE LA OPERAC.",null,"FECHA OPERAC.","GLOSA O DESCRIPCIÓN DE LA OPERACIÓN","REFERENCIA DE LA OPERACIÓN",null,null,null,null,"CUENTA CONTABLE ASOCIADA A LA OPERACIÓN",null,"MOVIMIENTO",null,"ENTIDAD"]
[null,null,null,null,"CÓDIGO DEL LIBRO","NÚMERO CORREL.","NÚMERO DEL DOCUMENTO",null,null,"CÓDIGO","DENOMINACIÓN","DEBE","HABER"]
["T. VOU.","NÚM.",null,null,null,null,"TIPO","SERIE","NÚMERO"]
["-",null,null,"SALDO INICIAL",null,null,null,null,null,null,null,{"$f":"SUM(CONSDIARIO1!F2:F800000)","v":0},{"$f":"SUM(CONSDIARIO1!G2:G800000)","v":0}]
[1,1,"2013-01-02","POR EL INICIO DE OPERACIONES",3,1,0,0,0,10100,"Caja",50000,0,0]
[1,1,"2013-01-02","POR EL INICIO DE OPERACIONES",3,1,0,0,0,50110,"Acciones",0,50000,0]
[2,1,"15/01/2013","VENTA DE MERCADERÍA",14,1,1,1,1,12120,"Emitidas en cartera",23600,0,20134567890]
[2,1,"15/01/2013","VENTA DE MERCADERÍA",14,1,1,1,1,40111,"IGV - Cuenta propia",0,3600,20134567890]
[2,1,"15/01/2013","VENTA DE MERCADERÍA",14,1,1,1,1,70111,"Terceros",0,20000,20134567890]
{"$rows_left_out":13}
{"sheet":"CONSULMAYOR","index":17,"n_rows":9,"n_cols":14,"rows_kept":9,"cut":false,"hidden":true,"merged":[]}
["CUENTA",null,"FECHA","TVOUCHER","VOUCHER","GLOSA","DEBE","HABER","ENTIDAD","TIPO","SERIE","NUMERO","=SI(SUMAR.SI(CONSDIARIO1!D2:D800000,D2,CONSDIARIO1!F2:F800000)>SUMAR.SI(CONSDIARIO1!D2:D800000,D2,CONSDIARIO1!G2:G800000),SUMAR.SI(CONSDIARIO1!D2:D800000,D2,CONSDIARIO1!F2:F800000)-SUMAR.SI(CONSDIARIO1!D2:D800000,D2,CONSDIARIO1!G2:G800000),0)","=SI(SUMAR.SI(CONSDIARIO1!D2:D800000,D2,CONSDIARIO1!G2:G800000)>SUMAR.SI(CONSDIARIO1!D2:D800000,D2,CONSDIARIO1!F2:F800000),SUMAR.SI(CONSDIARIO1!D2:D800000,D2,CONSDIARIO1!G2:G800000)-SUMAR.SI(CONSDIARIO1!D2:D800000,D2,CONSDIARIO1!F2:F800000),0)"]
[10100,null,"CUENTA",79100,{"$f":"IF(ISERROR(VLOOKUP(D2,TPC!B4:C2502,1,0))=FALSE,VLOOKUP(D2,TPC!B4:C2502,2,0),0)","v":"Cargas imputables a cuentas de costos y gastos"}]
[12120,null,"-",null,null,"SALDO INICIAL",{"$f":"IF(SUMIF(CONSDIARIO1!D2:D800000,D2,CONSDIARIO1!F2:F800000)>SUMIF(CONSDIARIO1!D2:D800000,D2,CONSDIARIO1!G2:G800000),SUMIF(CONSDIARIO1!D2:D800000,D2,CONSDIARIO1!F2:F800000)-SUMIF(CONSDIARIO1!D2:D800000,D2,CONSDIARIO1!G2:G800000),0)","v":0},{"$f":"IF(SUMIF(CONSDIARIO1!D2:D800000,D2,CONSDIARIO1!G2:G800000)>SUMIF(CONSDIARIO1!D2:D800000,D2,CONSDIARIO1!F2:F800000),SUMIF(CONSDIARIO1!D2:D800000,D2,CONSDIARIO1!G2:G800000)-SUMIF(CONSDIARIO1!D2:D800000,D2,CONSDIARIO1!F2:F800000),0)","v":0}]
[20111,null,"31/01/2013",6,1,"COSTO DE VENTA DEL MES",0,10000,0,0,0,0]
[40111,null,"-",null,null,"SUBTOTALES",0,10000]
[42120,null,"-",null,null,"SALDO FINAL",{"$f":"IF(H5>G5,H5-G5,0)","v":10000},{"$f":"IF(G5>H5,G5-H5,0)","v":0}]
[50110,null,"-",null,null,"TOTALES",10000,10000]
[60111,null,"-"]
[61110]

{"sheet":"LMAYOR","index":18,"n_rows":90,"n_cols":10,"rows_kept":90,"cut":false,"hidden":true,"merged":[[6,6,7,6],[6,3,7,3],[6,4,6,5]]}
["LIBRO MAYOR",null,null,null,null,"ENERO"]
["X",null,null,"X"]
[{"$f":"CONCATENATE(\"PERÍODO: \",mesconsultamayor,\" - \",periodo)","v":"PERÍODO: ENERO - 2013"}]
[{"$f":"CONCATENATE(\"RUC: \",ruc)","v":"RUC: 20123456789"}]
[{"$f":"IF(razon>\"\",razon,\"\")","v":"ARCHIVO EXCEL EIRL"}]
["X"]
["FECHA","NÚM. CORR. L. D.",null,"DESCRIPCION O GLOSA DE LA OPERACIÓN","SALDOS Y MOVIMIENTOS",null,"ENTIDAD","NÚMERO DEL DOCUMENTO"]
["OPERAC.","T. VOU.","NÚM.",null,"DEUDOR","ACREEDOR",null,"TIPO","SERIE","NÚMERO"]
["CUENTA",10100,"Caja"]
["-",null,null,"SALDO INICIAL",0,0]
["2013-01-02",1,1,"POR EL INICIO DE OPERACIONES",50000,0,0,0,0,0]
["31/01/2013",4,1,"COBRO DEL MES",23600,0,20134567890,1,1,1]
["-",null,null,"SUBTOTALES",73600,0]
["-",null,null,"SALDO FINAL",0,73600]
["-",null,null,"TOTALES",73600,73600]
{"$rows_left_out":76}
{"sheet":"BDRVENTA","index":19,"n_rows":5,"n_cols":3,"rows_kept":5,"cut":false,"hidden":true,"merged":[]}
["MES","VOUCHER"]
[]
[]
[]
[null,null,"Grabar y ordenar"]

{"sheet":"BDASTOVENTA","index":20,"n_rows":7,"n_cols":4,"rows_kept":7,"cut":false,"hidden":true,"merged":[]}
["MES","VOUCHER"]
[null,"01001"]
[]
[]
[null,"02001"]
[]
[null,null,null,"Grabar y ordenar"]

{"sheet":"BDRCOMPRA","index":21,"n_rows":3,"n_cols":3,"rows_kept":3,"cut":false,"hidden":true,"merged":[]}
["MES","VOUCHER"]
[]
[null,null,"Grabar y ordenar"]

{"sheet":"BDASTOCOMPRA","index":22,"n_rows":4,"n_cols":3,"rows_kept":4,"cut":false,"hidden":true,"merged":[]}
["MES","VOUCHER"]
[]
[]
[null,null,"Grabar y ordenar"]

{"sheet":"BDCAJA","index":23,"n_rows":8,"n_cols":3,"rows_kept":8,"cut":false,"hidden":true,"merged":[]}
["MES","VOUCHER"]
[]
[]
[null,null,"Grabar y ordenar"]
[]
[]
[]
[null,null,"NO VA"]

{"sheet":"BDASTOCAJA","index":24,"n_rows":4,"n_cols":15,"rows_kept":4,"cut":false,"hidden":true,"merged":[]}
["REGISTRO","MES","TVOUCHER","VOUCHER","FECHA","LIBRO","OPERACIÓN","TIPO","SERIE","NUMERO","BANCO","CUENTA","PAGO","ENTIDAD","GLOSA"]
[]
[]
[null,null,"Grabar y ordenar"]

{"sheet":"BDBANCO","index":25,"n_rows":8,"n_cols":3,"rows_kept":8,"cut":false,"hidden":true,"merged":[]}
["MES","VOUCHER"]
[]
[]
[]
[null,null,"Grabar y ordenar"]
[]
[]
[null,null,"NO VA"]

{"sheet":"BDASTOBANCO","index":26,"n_rows":5,"n_cols":3,"rows_kept":5,"cut":false,"hidden":true,"merged":[]}
["MES","VOUCHER"]
[]
[]
[]
[null,null,"Grabar y ordenar"]

{"sheet":"CONSULHT","index":27,"n_rows":22,"n_cols":7,"rows_kept":22,"cut":false,"hidden":true,"merged":[]}
["MES","REGISTRO","MES","CUENTA","NOMBRE","DEBE","HABER"]
["<2",111,1,10100,"Caja",50000,0]
[null,111,1,50110,"Acciones",0,50000]
[null,131,1,20111,"Costo",20000,0]
[null,131,1,61110,"Mercaderías manufacturadas",0,20000]
[null,131,1,60110,"Costo",20000,0]
[null,131,1,40111,"IGV - Cuenta propia",3600,0]
[null,131,1,42120,"Emitidas",0,23600]
[null,121,1,12120,"Emitidas en cartera",23600,0]
[null,121,1,40111,"IGV - Cuenta propia",0,3600]
[null,121,1,70111,"Terceros",0,20000]
[null,161,1,69111,"Terceros",10000,0]
[null,161,1,20111,"Costo",0,10000]
[null,161,1,61110,"Mercaderías manufacturadas",10000,0]
[null,161,1,79100,"Cargas imputables a cuentas de costos y gastos",0,10000]
{"$rows_left_out":8}
{"sheet":"HT","index":28,"n_rows":22,"n_cols":24,"rows_kept":22,"cut":false,"hidden":true,"merged":[[4,2,5,2]]}
[null,{"$f":"CONCATENATE(\"RUC: \",ruc)","v":"RUC: 20123456789"},null,null,null,null,null,null,null,null,null,null,"ENERO",null,"=SUMAR.SI(CONSULHT!D:D,HT!B7,CONSULHT!F:F)","=SUMAR.SI(CONSULHT!D:D,HT!B7,CONSULHT!G:G)","=SI(D7>E7,D7-E7,0)","=SI(E7>D7,E7-D7,0)","=SI(A7=1,F7,0)","=SI(A7=1,G7,0)","=SI(O(A7=3,A7=4),F7,0)","=SI(O(A7=3,A7=4),G7,0)","=SI(O(A7=2,A7=4),F7,0)","=SI(O(A7=2,A7=4),G7,0)"]
[null,{"$f":"IF(razon>\"\",razon,\"\")","v":"ARCHIVO EXCEL EIRL"}]
[null,{"$f":"CONCATENATE(\"HOJA DE TRABAJO A \",mesconsultaht,\" DEL \",periodo)","v":"HOJA DE TRABAJO A ENERO DEL 2013"}]
[null,"x"]
[null,"CTA","NOMBRE","SUMAS",null,"SALDO",null,"INVENTARIO",null,"RESULTA. POR NATUR.",null,"RESULTA. POR FUNC."]
[null,"X",null,"DEBE","HABER","DEUDOR","ACREEDOR","ACTIVO","PASIVO","PERDIDA","GANANCIA","PERDIDA","GANANCIA"]
[1,10100,"Caja",73600,0,73600,0,73600,0,0,0,0,0,null,null,{"$f":"MID(B7,1,2)","v":"10"}]
[1,12120,"Emitidas en cartera",23600,23600,0,0,0,0,0,0,0,0,null,null,"12"]
[1,20111,"Costo",20000,10000,10000,0,10000,0,0,0,0,0,null,null,"20"]
[1,40111,"IGV - Cuenta propia",3618,3600,18,0,18,0,0,0,0,0,null,null,"40"]
[1,42120,"Emitidas",0,23718,0,23718,0,23718,0,0,0,0,null,null,"42"]
[1,50110,"Acciones",0,50000,0,50000,0,50000,0,0,0,0,null,null,"50"]
[3,60110,"Mercaderías manufacturadas",20000,0,20000,0,0,0,20000,0,0,0,null,null,"60"]
[3,61110,"Mercaderías manufacturadas",10000,20000,0,10000,0,0,0,10000,0,0,null,null,"61"]
[3,63610,"Energía eléctrica",100,0,100,0,0,0,100,0,0,0,null,null,"63"]
{"$rows_left_out":8}
{"sheet":"BG","index":29,"n_rows":43,"n_cols":6,"rows_kept":43,"cut":false,"hidden":true,"merged":[]}
[{"$f":"IF(razon>\"\",razon,\"\")","v":"ARCHIVO EXCEL EIRL"}]
[{"$f":"CONCATENATE(\"RUC: \",ruc)","v":"RUC: 20123456789"}]
["BALANCE GENERAL"]
[{"$f":"CONCATENATE(\"A \",mesconsultaht,\" DEL \",periodo)","v":"A ENERO DEL 2013"}]
["(Expresado en Nuevos Soles)"]
[]
["COD","ACTIVO","S/.","COD","PASIVO Y PATRIMONIO","S/."]
[null,"ACTIVO CORRIENTE",null,null,"PASIVO CORRIENTE"]
[10,"EFECTIVO Y EQUIVALENTES DE EFECTIVO",{"$f":"SUMIF(HT!P:P,A9,HT!H:H)-SUMIF(HT!P:P,A9,HT!I:I)","v":73600},40,"TRIBUTOS, CONTRAPRESTACIONES Y APORTES AL SISTEMA DE PENSIONES Y DE SALUD POR PAGAR",{"$f":"SUMIF(HT!P:P,D9,HT!I:I)-SUMIF(HT!P:P,D9,HT!H:H)","v":-18}]
[11,"INVERSIONES FINANCIERAS",{"$f":"SUMIF(HT!P:P,A10,HT!H:H)-SUMIF(HT!P:P,A10,HT!I:I)","v":0},41,"REMUNERACIONES Y PARTICIPACIONES POR PAGAR",{"$f":"SUMIF(HT!P:P,D10,HT!I:I)-SUMIF(HT!P:P,D10,HT!H:H)","v":0}]
[12,"CUENTAS POR COBRAR COMERCIALES – TERCEROS",{"$f":"SUMIF(HT!P:P,A11,HT!H:H)-SUMIF(HT!P:P,A11,HT!I:I)","v":0},42,"CUENTAS POR PAGAR COMERCIALES – TERCEROS",{"$f":"SUMIF(HT!P:P,D11,HT!I:I)-SUMIF(HT!P:P,D11,HT!H:H)","v":23718}]
[13,"CUENTAS POR COBRAR COMERCIALES – RELACIONADAS",{"$f":"SUMIF(HT!P:P,A12,HT!H:H)-SUMIF(HT!P:P,A12,HT!I:I)","v":0},43,"CUENTAS POR PAGAR COMERCIALES – RELACIONADAS",{"$f":"SUMIF(HT!P:P,D12,HT!I:I)-SUMIF(HT!P:P,D12,HT!H:H)","v":0}]
[14,"CUENTAS POR COBRAR AL PERSONAL, A LOS ACCIONISTAS (SOCIOS), DIRECTORES Y GERENTES",{"$f":"SUMIF(HT!P:P,A13,HT!H:H)-SUMIF(HT!P:P,A13,HT!I:I)","v":0},44,"CUENTAS POR PAGAR A LOS ACCIONISTAS (SOCIOS), DIRECTORES Y GERENTES",{"$f":"SUMIF(HT!P:P,D13,HT!I:I)-SUMIF(HT!P:P,D13,HT!H:H)","v":0}]
[16,"CUENTAS POR COBRAR DIVERSAS - TERCEROS",{"$f":"SUMIF(HT!P:P,A14,HT!H:H)-SUMIF(HT!P:P,A14,HT!I:I)","v":0},null,"Total Pasivo Corriente",{"$f":"SUM(F9:F13)","v":23700}]
[17,"CUENTAS POR COBRAR DIVERSAS - RELACIONADAS",{"$f":"SUMIF(HT!P:P,A15,HT!H:H)-SUMIF(HT!P:P,A15,HT!I:I)","v":0}]
{"$rows_left_out":29}
{"sheet":"ER","index":30,"n_rows":60,"n_cols":3,"rows_kept":60,"cut":false,"hidden":true,"merged":[]}
[{"$f":"IF(razon>\"\",razon,\"\")","v":"ARCHIVO EXCEL EIRL"}]
[{"$f":"CONCATENATE(\"RUC: \",ruc)","v":"RUC: 20123456789"}]
["ESTADO DE GANANCIAS Y PERDIDAS POR FUNCIÓN"]
[{"$f":"CONCATENATE(\"A \",mesconsultaht,\" DEL \",periodo)","v":"A ENERO DEL 2013"}]
["(Expresado en Nuevos Soles)"]
[]
["COD","CUENTA","S/."]
[70,"VENTAS",{"$f":"SUMIF(HT!P:P,A8,HT!M:M)-SUMIF(HT!P:P,A8,HT!L:L)","v":20000}]
[74,"DESCUENTOS, REBAJAS Y BONIFICACIONES CONCEDIDOS",{"$f":"SUMIF(HT!P:P,A9,HT!M:M)-SUMIF(HT!P:P,A9,HT!L:L)","v":0}]
[null,"VENTAS NETAS",{"$f":"SUM(C8:C9)","v":20000}]
[]
[69,"COSTO DE VENTAS",{"$f":"SUMIF(HT!P:P,A12,HT!M:M)-SUMIF(HT!P:P,A12,HT!L:L)","v":-10000}]
[null,"UTILIDAD BRUTA",{"$f":"SUM(C10:C12)","v":10000}]
[]
[null,"Gastos de Operación"]
{"$rows_left_out":46}
{"sheet":"Hoja1","index":31,"n_rows":13,"n_cols":10,"rows_kept":13,"cut":false,"hidden":true,"merged":[]}
[]
["ENERO",null,null,"NUEVOS SOLES",null,null,"INGRESO",null,1,"BALANCE GENERAL"]
["FEBRERO",null,null,"DÓLARES AMERICANOS",null,null,"EGRESO",null,2,"E. R. FUNCIÓN"]
["MARZO",null,null,null,null,null,null,null,3,"E. R. NATURALEZA"]
["ABRIL",null,null,null,null,null,null,null,4,"E. R. FUNC. Y NATUR."]
["MAYO"]
["JUNIO"]
["JULIO"]
["AGOSTO"]
["SEPTIEMBRE"]
["OCTUBRE"]
["NOVIEMBRE"]
["DICIEMBRE"]

{"sheet":"ae","index":32,"n_rows":5,"n_cols":12,"rows_kept":5,"cut":false,"hidden":false,"merged":[]}
["SISTEMA CONTABLE AExcel"]
["HECHO POR:",null,1,"ENERO",null,1,null,null,null,null,null,11]
["www.archivoexcel.com"]
[null,null,null,null,null,null,null,10]
[null,null,14,"REGISTRO DE VENTAS E INGRESOS"]